Compiler Error Message The Compiler Failed With Error Code 128

RECOMMENDED: If you have Windows errors then we strongly recommend that you download and run this (Windows) Repair Tool.

The compiler failed with error code 128 error while uploading a new web page in my website. Compiler Error Message: The compiler failed with error code 128.

Spring MVC Fast Tutorial: Hello World – Jérôme Jaglale – I tried but it doesn’t work, i got the message: javax.servlet.ServletException: Servlet.init() for servlet springmvc threw exception at org.apache.catalina.core.

Firstly, you need the python-dev package because Pillow needs compile. In addition to the above installs I still had the above error installing.

Compiler Error Message: The compiler failed with error code 128. Compiler Error Message: The compiler failed with error code 128. Jul 29,

For this 4GL compiler message, you need a C compiler to finish compiling your program. See the message log file to get the Enterprise Replication error code. This general onaudit failure message could indicate that a command is incorrect or incomplete, the database is inaccessible, -128 ISAM error: no logging.

Compiler Error Message: The compiler failed with error code 128. I have deployed my website to a server hosted by a hosting company. (WebHost4life).

Compiler Error Message: The compiler failed with error code 128. The compiler failed with error code 128. and worked for me. 1 – I reinstalled Framework v2.0. 2.

When a page from the application crashed, a 500 error code was returned with an error message similar to the.

I keep getting an error message when I try to access. The compiler failed with error code 128. the "Compiler Error Message: The compiler failed with error.

Event 6161 Error 250 Your “quick pitch” is limited to 250 characters per category. For example, if you’re pitching event-planning services, you might mention the office holiday party you. Widget settings form goes here Save changes Close. RELEVANCY SCORE 4.31 There are potential changes to driving licence regulations following a review by DVLA which may be good news for

39 * 2) you are going to use this API code in multi-thread application, and

Another Strange ASP.net Error: The compiler failed with error code 255 – Please review the following specific error details and modify your source code appropriately. Compiler Error Message: The compiler failed with error code 255. None of the solutions from other SO posts have helped.

Error 36 Fix Error 36 problems include computer crashes, freezes, and possible virus infection. Learn how to fix these iTunes runtime errors quickly and easily! Fix Registry, Optimize PC Speed Get a Faster PC Today, Try Now! Boost Your PC Speed & Performance – Defrag, Clean & Optimize Your PC Today! Mac users or those who are running

Compiler Error Message: The compiler failed with error code 128. We have googled it lot's of times but every time someone has the same problem it's on the 1.1.

Hp C4100 Carriage Jam Error Please make sure you have not missed any steps listed here: A ‘Carriage Jam’ or ‘Carriage Blocked’ Error Message Displays for HP Photosmart C4100 All-in-One Pri. If you have completed ALL steps and are still getting the error. I recently had my HP Photosmart Premium stop working. Initially, it failed with an error message requesting

Acronym: Meaning: AMC Advanced Mezzanine Card CCS Texas Instruments Code Composer Studio CSL Texas Instruments Chip Support Library DDR Double Data Rate

You can search for any kind of error, not just those that begin with ‘ORA-‘. If you do not have an Internet connection, you can look up error messages and other.

LoadRunner Vu Scripting – Wilson Mar.com – Scripting Mercury LoadRunner Automated Web Software Performance Analysis Tool / Utility Tips, Tricks on Installation, Debugging

Dec 25, 2014. error: command 'gcc' failed with exit status 1. –single-version-externally- managed –compile failed with error code 1 in.

Firstly, when I open a new Matlab I get the following warning message. 199: error: ‘YP_OUT’ undeclared (first use in this function) yprime.c:204: error: ‘T_IN’ undeclared (first use in this function) mex: compile of ‘ "yprime.c"’ failed.

Using this site ARM Forums and knowledge articles Most popular knowledge articles Frequently asked questions How do I navigate the site?

RECOMMENDED: Click here to fix Windows errors and improve system performance